Broke it

3 jobs for master in 1 minute and 14 seconds (queued for 1 second)
Status Name Job ID Coverage
  Build
passed build #108294

00:00:43

 
  Test
failed test #108295

00:00:31

 
  Deploy
skipped deploy #108296
 
Name Stage Failure
failed
test Test There is an unknown failure, please try again
[ERROR] Please refer to /home/gitlab-runner/builds/d8e0744d/0/aen917/simplewebapp/target/surefire-reports for the individual test results.
[ERROR] -> [Help 1]
[ERROR]
[ERROR] To see the full stack trace of the errors, re-run Maven with the -e switch.
[ERROR] Re-run Maven using the -X switch to enable full debug logging.
[ERROR]
[ERROR] For more information about the errors and possible solutions, please read the following articles:
[ERROR] [Help 1] http://cwiki.apache.org/confluence/display/MAVEN/MojoFailureException
ERROR: Job failed: exit status 1