break test to test pipeline

5 jobs for master in 39 seconds (queued for 1 second)
Status Name Job ID Coverage
  Build
passed build-job #503335

00:00:14

failed build-job #503331

00:00:00

 
  Test
failed test-job #503332

00:00:25

 
  Deploy Staging
skipped deploy-test #503333
 
  Deploy
skipped deploy-prod #503334
 
Name Stage Failure
failed
test-job Test
[ERROR] -> [Help 1]
[ERROR]
[ERROR] To see the full stack trace of the errors, re-run Maven with the -e switch.
[ERROR] Re-run Maven using the -X switch to enable full debug logging.
[ERROR]
[ERROR] For more information about the errors and possible solutions, please read the following articles:
[ERROR] [Help 1] http://cwiki.apache.org/confluence/display/MAVEN/MojoFailureException
Cleaning up file based variables
ERROR: Job failed: exit code 1