BREAK Putin test

4 jobs for master in 1 minute and 1 second (queued for 1 second)
Status Name Job ID Coverage
  Build
passed build #503276

00:00:19

 
  Test
failed test #503277

00:00:41

 
  Deploy
skipped deploy #503278
 
  Deploy Production
skipped deploy_production #503279
 
Name Stage Failure
failed
test Test
[ERROR] -> [Help 1]
[ERROR]
[ERROR] To see the full stack trace of the errors, re-run Maven with the -e switch.
[ERROR] Re-run Maven using the -X switch to enable full debug logging.
[ERROR]
[ERROR] For more information about the errors and possible solutions, please read the following articles:
[ERROR] [Help 1] http://cwiki.apache.org/confluence/display/MAVEN/MojoFailureException
Cleaning up file based variables
ERROR: Job failed: exit code 1