add powerful search

4 jobs for master in 1 minute and 17 seconds (queued for 7 seconds)
Status Job ID Name Coverage
  Compile
passed compile #499139

00:00:35

 
  Test
failed test #499140

00:00:42

 
  Deploy
skipped deploy #499141
simplewebapp
 
  Herokudeploy
skipped herokudeploy #499142
simplewebapp
 
Name Stage Failure
failed
test Test
[ERROR] -> [Help 1]
[ERROR]
[ERROR] To see the full stack trace of the errors, re-run Maven with the -e switch.
[ERROR] Re-run Maven using the -X switch to enable full debug logging.
[ERROR]
[ERROR] For more information about the errors and possible solutions, please read the following articles:
[ERROR] [Help 1] http://cwiki.apache.org/confluence/display/MAVEN/MojoFailureException
Cleaning up file based variables
ERROR: Job failed: exit code 1