welcome mark and failed test

4 jobs for master in 42 seconds (queued for 1 second)
Status Name Job ID Coverage
  Compile
passed compile #499340

00:00:22

 
  Test
failed test #499341

00:00:20

 
  Deploy
skipped deploy #499342
simplewebapp
 
  Herokudeploy
skipped herokudeploy #499343
simplewebapp
 
Name Stage Failure
failed
test Test
[ERROR] -> [Help 1]
[ERROR]
[ERROR] To see the full stack trace of the errors, re-run Maven with the -e switch.
[ERROR] Re-run Maven using the -X switch to enable full debug logging.
[ERROR]
[ERROR] For more information about the errors and possible solutions, please read the following articles:
[ERROR] [Help 1] http://cwiki.apache.org/confluence/display/MAVEN/MojoFailureException
Cleaning up file based variables
ERROR: Job failed: exit code 1